{"text_format":"1","workbook":"xlsx","n_sheets":8,"sheets":["Comments","Progress-Status","Categories","Detailed Status","To-Do","Historical Status","CAD","Sheet1"],"not_rendered":{"charts":0,"images":0,"macros":1,"external_links":0,"defined_names":3,"comments":1,"pivot_tables":0},"unopened":[],"bounds":{"document_bytes":16777216,"sheet_cells":100000,"rows_first":2000,"rows_last":500,"rows_between":2000,"halvings":0,"cell_chars":16384,"cell_head_chars":4096},"cells_cut":0,"cells_raw":0,"read":"whole","date_system":"1900"}

{"sheet":"Comments","index":0,"n_rows":1472,"n_cols":22,"rows_kept":1472,"cut":false,"hidden":false,"merged":[]}
["Comment ID","Comment #","Name","Style","Index #","Vote","Affiliation","Category","Page","Sub-clause","Line #","Comment","File","Proposed Change","Must Be Satisfied?","Disposition Status (Accepted, Rejected, Revised)","Disposition Detail","Category","Notes","Editor Status DONE, Ready, N/A)","Editor Notes","Assignee"]
[null,null,"Billy Verso",null,1016,"No","Qorvo","Editorial",9,"Introduction",9,"IEEE Std 802.15.4-2020 will need to change when the 4me revision is completed, might be good to highlight this also to make it stand out as something subject to change.",null,"Highlight/change the 2020 like is done on line 5","Yes",null,null,"TE",null,"ASSIGNED",null,"Editor"]
[null,null,"Billy Verso",null,1017,"No","Qorvo","Editorial",9,"Introduction",26,"empty numbered line",null,"delete it","Yes","Accepted",null,"TE",null,"DONE"]
[null,null,"Billy Verso",null,1018,"No","Qorvo","Editorial",9,"Introduction",29,"for next revision of the draft the 4me draft reference here will need to change",null,"change it appropriately.","Yes",null,null,"TE",null,"ASSIGNED",null,"Editor"]
[null,null,"Tero Kivinen",null,280,"No","Self","Editorial",9,null,8,"The ranging capabilities in the -2020 version were quite limited, most of the ranging capabilities were added in 802.15.4z-2020. ",null,"Change to refere to 802.15.4z amendment?","No",null,null,"TE",null,"ASSIGNED","This whole intro was copied from 802.15.4z…. When I copied in in I meant to revise but forgot, will need a larger review.","Editor"]
[null,null,"Tero Kivinen",null,281,"No","Self","Technical",13,2,18,"The RFC 1951 Deflate compression is only used by one optional feature, there is no need for normative reference, as not everybody who reads 802.15.4 needs to understand what deflate does. ",null,"Move IETF RFC 1951 to bibliography.","Yes","Rejected","In clause 10.39.4.6.3, it states that \"If compression is enabled (as indicated by the Compression field  CIR Taps field of each receive report shall be compressed individually using the DEFLATE compressed data format described in IETF RFC 1951. \" which is a normative requirement","MISC",null,"N/A"]
[null,null,"Billy Verso",null,1019,"No","Qorvo","Technical",13,"3,1",23,"the term \"hash\" is used in the text, a definition should be added.",null,"include a definition for the term \"hash\"","Yes",null,null,"MISC",null,"ASSIGNED",null,"Tero"]
[null,null,"Lei HUANG",null,1429,"Yes","Huawei","Editorial",14,"3.2",16,"RPA should stand for \"resolvable private address\" instead of \"resolvable private addresses\"",null,"as in comment","Yes","Accepted",null,"MISC",null,"DONE"]
[null,null,"Lei HUANG",null,1430,"Yes","Huawei","Technical",14,"3.2",20,"HRP-SDEV and SDEV actually refer to the same type of 4ab devices. HRP-SDEV seems a better name. ",null,"delete SDEV","Yes",null,null,"TE",null,"ASSIGNED",null,"Billy"]
[null,null,"Tero Kivinen",null,282,"No","Self","Editorial",15,6.3,1,"There is extra PDF index subsection entries 6.3.1. ",null,"Remove extra PDF index entries.","No",null,null,"TE",null,"ASSIGNED","PI","Editor"]
[null,null,"Tero Kivinen",null,285,"No","Self","Editorial",15,"5.2.5",5,"This is first use of the RSS outside the headers, expand here. ",null,"Expand RSS here.","No","Accepted",null,"TE",null,"DONE"]
[null,null,"Billy Verso",null,1020,"No","Qorvo","Editorial",15,"5.2.5",5,"Other than in the heading, \"The RSS defined …\" is first use of the RSS acronym in the text so the full definition should appear too.",null,"Change to: \"The Ranging support service (RSS) defined …\"","Yes","Accepted",null,"TE",null,"DONE"]
[null,null,"Billy Verso",null,1021,"No","Qorvo","Technical",15,"6.6.1",15,"This clause in the base standard describes transmission  steps.  It needs to be amended to also cover compact frame transmission.",null,"Review and amend appropriately.  At the very least it need to refer to the appropriate security clause, but it may need other actions also.","Yes",null,null,"NEWFR",null,"ASSIGNED",null,"Alex"]
[null,null,"Billy Verso",null,1022,"No","Qorvo","Technical",15,"6.6.2",15,"This clause in the base standard describes reception steps.  It needs to be amended to also cover compact frame reception.",null,"Review and amend appropriately.","Yes",null,null,"NEWFR",null,"ASSIGNED",null,"Alex"]
[null,null,"Billy Verso",null,1023,"No","Qorvo","Technical",15,"6.6.2",15,"This clause in the base standard describes reception steps and tells us to discard frames with bad CRC.  Rather than having to amend and maintain this for every compact frame encoding that has MIC instead of CRC, (and complicating the MAC receive processing implementation in the process), suggest to add CRC as part of the compact frame definition in clause 7.3.7 and remove CRC from the Compact Frame Content field definitions of clause 10.38.10.",null,"To simplify the low level MAC processing in everyone's implementation, make the CRC a common mandatory part of all Compact Frames. i.e. Add CRC are the end of the frame in Figure 1, and description text sub-clause in 7.3.7","Yes",null,null,"NEWFR",null,"ASSIGNED",null,"Alex"]
[null,null,"Kangjin Yoon",null,1413,"No","Spark Microsystems","Editorial",15,"6.6.3.3",17,"Typo",null,"Change \"Acknowledgment\" to \"Acknowledgement\"","Yes","Rejected","Acknowledgment is the spelling used throughout the base standard.","TE",null,"N/A"]
[null,null,"Tero Kivinen",null,284,"No","Self","Editorial",15,"6.6.3.3",24,"This is first use of HRP-EMDEV acronym, expand here. ",null,"Expand HRP-EMDEV here.","No","Accepted",null,"TE",null,"DONE"]
[null,null,"Tero Kivinen",null,283,"No","Self","Technical",15,"6.6.3.3",25,"Why there is need for specific macEmdevImmAckAifsPeriod? The HRP-EMDEV will always use this different values regardless of mode (i.e., the high-rate pulse repetition frequency UWB PHY based enhanced modulations device will always use this) so it can be just be configured in the macSifsPeriod. ",null,"Or is it trying to say that high-rate pulse repetition frequency UWB PHY based enhanced modulations devices sometimes use this macEmdevImmAckAifsPeriod and sometimes uses macSifsPeriod? The HRP-EMDEV is device property, not a mode inside the device. Is the HRP-EMDEV supposed to be mode for devices not a device type itself?","Yes",null,null,"ACK",null,"ASSIGNED",null,"Ben"]
[null,null,"Alex Krebs",null,1401,"No","Apple","Technical",15,"6.6.3.3","24-26","Fixing AIFS, but leaving SIFS, LIFS unchanged as 12 and 40 preamble symbols seems to be conflicting with the base standard requiring AIFS<SIFS<LIFS.",null,"Add definitions for SIFS and LIFS for HRP-EMDEV with adequate values.","Yes",null,null,"ACK",null,"ASSIGNED",null,"Ben"]
[null,null,"B. Rolfe",null,1322,"Yes","BCA","Editorial",16,"6.6.3.34",1,"The heading for clause 6.6.3.4 went missing. It would be nice to have it back. ",null,"If it can be found, insert it before the editing instruction",null,"Accepted",null,"TE",null,"DONE"]
{"$rows_left_out":1453}
{"sheet":"Progress-Status","index":1,"n_rows":497,"n_cols":26,"rows_kept":497,"cut":false,"hidden":false,"merged":[[1,10,1,18],[6,4,6,6],[10,10,10,16],[1,1,1,8],[18,1,18,23]]}
[]
[null,"Comments and Resolution Status",null,null,null,null,null,null,null,null,"Draft editing Status"]
[]
[null,"Total #  Comments","# with Blank resolution","# with non-blank resolution","# with \"Rejected\" resolution","# with \"Accepted\" resolution","# with \"Revised\" resolution","# Assigned","No Resolution, not Assigned",null,"DONE","N/A",null,"PART","Ready","ISSUE","ASSIGNED",null,"Blanks"]
[null,{"$f":"COUNTA(Comments!E:E)-1","v":1471},{"$f":"B5-D5","v":1278},{"$f":"COUNTA(Comments!P:P)-1","v":193},{"$f":"COUNTIF(Comments!P:P,\"Rejected\")","v":12},{"$f":"COUNTIF(Comments!P:P,\"Accepted\")","v":130},{"$f":"COUNTIF(Comments!P:P,\"Revised\")","v":51},{"$f":"COUNTA(Comments!V:V)-1","v":1278},{"$f":"B5-D5-H5","v":0},null,{"$f":"COUNTIF(Comments!T:T,K4)","v":154},{"$f":"COUNTIF(Comments!T:T,L4)","v":12},null,{"$f":"COUNTIF(Comments!T:T,N4)","v":0},{"$f":"COUNTIF(Comments!T:T,O4)","v":27},{"$f":"COUNTIF(Comments!T:T,P4)","v":0},{"$f":"COUNTIF(Comments!T:T,Q4)","v":1278},null,{"$f":"B5-(COUNTA(Comments!T:T)-1)","v":0}]
[]
[null,"Technical","Editorial",{"$f":"IF(D5=E7,\"Okay\",\"MIS-MATCHED\")","v":"Okay"},{"$f":"E5+F5+G5","v":193},null,null,null,null,null,{"$f":"SUM(K5:L5)","v":166},"Done + N/A"]
[null,{"$f":"COUNTIF(Comments!H:H,B7)","v":854},{"$f":"COUNTIF(Comments!H:H,C7)","v":611}]
[null,"General",{"$f":"IF(B5=C10,\"Okay\",\"MIS-MATCHED\")","v":"Okay"},{"$f":"D5/$B5","v":0.13120326308633581},8.1577158395649222E-3,8.8375254928619987E-2,3.4670292318150921E-2,0.86879673691366421,0,null,{"$f":"K7/$B$5","v":0.11284840244731476},"of total",null,{"$f":"N5/$B$5","v":0},{"$f":"O5/$B$5","v":1.8354860639021073E-2},{"$f":"P5/$B$5","v":0},{"$f":"Q5/$B$5","v":0.86879673691366421},null,{"$f":"S5/$B$5","v":0}]
[null,{"$f":"COUNTIF(Comments!H:H,B9)","v":6},{"$f":"C8+B8+B10","v":1471}]
[null,null,null,null,null,null,null,null,null,null,{"$f":"K9+SUM(N9:Q9)","v":1}]
[]
[]
[]
[]
[]
[]
[]
[null,"Assigned Comments"]
[]
{"$rows_left_out":478}
{"sheet":"Categories","index":2,"n_rows":497,"n_cols":23,"rows_kept":497,"cut":false,"hidden":false,"merged":[]}
["MMS w/NBA","MMS wo/NBA","New frame format","Ack changes","RSS","SSBD","Other channel access","Security","Multi-node ranging / Hyper Block","Narrow Band function","Device discovery Ranging","Device discovery Data","Parameter Negotiation","Wake-up Radio","UWB data offload","Narrow Band PHY","UWB PHY HRP","UWB PHY LE","Sensing","Dynamic Data Rate Mode","PICS","IEs","OTHER"]
["NBMSS","UWBMSS","NEWFR","ACK","RSS","SSBD","CHA","SEC","HB","NBF","DISC-R","DISC-D","PARNEG","WUR","UWBDO","PHYNB","PHYHRP","PHYLE","SENS","DDRN","PICS",null,"OTHER"]
["Alex","Carl","Alex","Billy","Sven","Larry","Ben","Rojan","Youngwan","Alex","Alex","[Carlos]","Billy","Billy","Youngwan","Bin Q","Vinod","Larry","Pooria & Bin Q","[Carlos]"]
[]
[]
[]
[null,null,null,null,null,"11.2.8"]
[null,null,null,null,null,"12.3.2"]
[]
[]
[]
[]
[]
[]
[]
[]
[]
[]
[]
[]
{"$rows_left_out":478}
{"sheet":"Detailed Status","index":3,"n_rows":4,"n_cols":21,"rows_kept":4,"cut":false,"hidden":false,"merged":[[2,10,2,19],[3,10,3,19],[0,9,0,20],[1,9,1,20],[0,1,0,3],[1,1,1,3],[0,6,0,8],[1,6,1,8],[0,4,0,5],[1,4,1,5]]}
["Resolution","Accepted",null,null,"Rejected",null,"Revised",null,null,"Blank"]
[null,{"$f":"COUNTIF(Comments!P:P,\"Accepted\")","v":130},null,null,{"$f":"COUNTIF(Comments!P:P,\"Rejected\")","v":12},null,{"$f":"COUNTIF(Comments!P:P,\"Revised\")","v":51},null,null,0]
["Editor Status","ISSUE","Ready","DONE","Waiting","N/A","ISSUE","Ready","DONE","Ready","Assigned",null,null,null,null,null,null,null,null,null,"Unassigned"]
[null,0,0,0,0,0,0,0,0,0,0,null,null,null,null,null,null,null,null,null,0]

{"sheet":"To-Do","index":4,"n_rows":0,"n_cols":0,"rows_kept":0,"cut":false,"hidden":false,"merged":[]}

{"sheet":"Historical Status","index":5,"n_rows":26,"n_cols":34,"rows_kept":26,"cut":false,"hidden":false,"merged":[[7,0,13,0],[14,0,24,0]]}
["Version",null,"-00","-01","-02","-03","-04","-05","-06","-07","-08","-09",null,"-14","-15","-16","-17","-18","-19",null,"-21","-22",null,"-24","-25","-26","-27","-28","-29","-30","-31","-32","-33,-34","-35"]
["Date",null,"2024-07-14","2024-07-16","2024-07-18","2024-07-30","2024-07-30",null,"2024-08-08","2024-08-13",null,"2024-08-22"]
["Occasion",null,"Initial spreadsheet",null,"End of 2024-07 session","Before 2024-07-30 telecon","After 2024-07-30 telecon",null,"After 2024-08-08 telecon","Before 2024-08-13 telecon",null,"After 2024-08-22 telecon"]
[]
[]
[]
[]
["Editorial","Total",614,614,611,611,611,null,611,611,null,611]
[null,"Addressed",0,3,3,51,51,null,51,84,null,84]
[null,"Ready",0,2,2,2,2,null,0,0,null,0]
[null,"Done",0,0,0,47,47,null,49,81,null,81]
[null,"N/A",0,1,1,2,2,null,2,3,null,3]
[null,"ISSUE",0,0,0,0,0,null,0,0,null,0]
[null,"To Be Addressed",614,611,608,560,560,null,560,527,null,527]
["Technical/General","Total",856,856,859,859,860,null,860,860,null,860]
[null,"Addressed",0,29,65,65,66,null,80,80,null,109]
[null,"Ready",0,27,59,54,55,null,14,1,null,27]
[null,"Done",0,0,0,5,5,null,60,73,null,73]
[null,"N/A",0,2,6,6,6,null,6,6,null,9]
[null,"To Be Addressed",856,825,794,794,794,null,780,780,null,751]
{"$rows_left_out":7}
{"sheet":"CAD","index":6,"n_rows":48,"n_cols":22,"rows_kept":48,"cut":false,"hidden":false,"merged":[]}
["Comment ID","Comment #","Name","Style","Index #","Vote","Affiliation","Category","Page","Sub-clause","Line #","Comment","File","Proposed Change","Must Be Satisfied?","Disposition Status (Accepted, Rejected, Revised)","Disposition Detail","Category","Notes","Editor Status DONE, Ready, N/A)","Editor Notes","Assignee"]
[null,null,null,null,"CAD015",null,null,"Editorial",3,1,2,"802.19 comment from Kazuto Yano on CA document: \"assesment\" must be \"assessment\".",null,"Please fix this typo.","No","Accepted"]
[null,null,null,null,"CAD012",null,null,"Technical",3,1,9,"802.19 comment from Kazuto Yano on CA document: In Clause 1, 802.15.6 is noted that it is to be considered. However, Clause 5 where coexistence between 802.15.6 and 802.15.4ab would be discussed is blank.",null,"Please discuss the coexistence between 802.15.6 and 802.15.4ab.","Yes",null,null,null,null,"ASSIGNED",null,"Ben"]
[null,null,"Alex Krebs",null,"CAD044",null,"Apple","Editorial",3,"1.1","not sure","More acronyms are used in the document without declaration.",null,"Add OFDM, O-QPSK, PHY, WLAN, MAC, ACK, NACK to the list of abbreviations.","Yes"]
[null,null,null,null,"CAD001",null,null,"Editorial",5,2,6,"802.19 comment from Billy Verso on CA document: Repetition on 5th line of first paragraph \"the original UWB PHY was renamed the original UWB PHY was renamed\"",null,"Replace with a single \"the original UWB PHY was renamed\"","No","Accepted"]
[null,null,null,null,"CAD002",null,null,"Editorial",5,2,9,"802.19 comment from Billy Verso on CA document: Using HRP (or LRP) on its own is not correct, nor is \"HRP PHY\".  It should always be written as the HRP UWB PHY, and, the LRP UWB PHY.",null,"Change to \"The HRP channel plan\" to \"The HRP UWB PHY channel plan\", and review other occurrences of HRP and LRP to similarly correct them.","No","Accepted"]
[null,null,null,null,"CAD003",null,null,"Technical",5,2,11,"802.19 comment from Billy Verso on CA document: In third line of 2nd paragraph, \"optional wider channels (from 1.2 to 1.5 GHz).\", is slightly wrong.  The HRP UWB PHY Channel 7 is 1081.6 MHz bandwidth, which rounds to 1.1 GHz, while the widest channel #15 is 1354.97 MHz bandwidth.",null,"Change to \"optional wider channels (from 1.1 to 1.4 GHz).\"","No","Accepted"]
[null,null,null,null,"CAD038",null,null,"Editorial",5,2,null,"802.19 comment from Dorothy Stanley on CA document: Duplicate text \"the original UWB PHY was renamed\"",null,"Delete one of the repeated phrases","Yes","Accepted"]
[null,null,null,null,"CAD008",null,null,"General",5,"2.1.1",50,"802.19 comment from Stephan Sand on CA document: The document is incomplete.",null,"Add detail on channel plans,\nalso on P6L3 a reference is broken,\nheading 2.1.3 should read Summary of Amendment 802.15.4ab\nSection 5 is empty\nSection 6 is empty","No",null,null,null,null,"ASSIGNED",null,"Ben"]
[null,null,null,null,"CAD037",null,null,"Technical",5,"2.1.1",null,"802.19 comment from Dorothy Stanley on CA document: \"[can provide details of the channel plans] - the text appears incomplete. Either provide the details or provide a reference to the details.",null,"As in comment.","Yes",null,null,null,null,"ASSIGNED",null,"Ben"]
[null,null,null,null,"CAD018",null,null,"Editorial",6,"2.1.2",2,"802.19 comment from Stephen Shellhammer on CA document: There is a reference error in the document",null,"Fix the reference error","No","Accepted"]
[null,null,null,null,"CAD013",null,null,"Editorial",6,"2.1.2",3,"802.19 comment from Kazuto Yano on CA document: There is a reference error denoted by \"Error! Reference source not found.\"",null,"Please fix the reference error.","Yes","Accepted"]
[null,null,"Alex Krebs",null,"CAD045",null,"Apple","Editorial",6,"2.1.2","Table 1","Different font sizes in partially unfilled table",null,"User greater of the font sizes for all cells, remove empty cells","Yes"]
[null,null,null,null,"CAD039",null,null,"Technical",6,"2.1.2",null,"802.19 comment from Dorothy Stanley on CA document: 5935 or 5945? https://mentor.ieee.org/802-ec/dcn/22/ec-22-0266-00-WCSG-ieee-802-s-wireless-standards-table-of-frequency-ranges.xlsx indicates 5945.",null,null,"Yes",null,null,null,null,"ASSIGNED",null,"Ben"]
[null,null,"Alex Krebs",null,"CAD040",null,"Apple","Editorial",7,"2.2","3 from page bottom","Typo \"liner\"",null,"Change to \"linear\"","Yes"]
[null,null,null,null,"CAD004",null,null,"Technical",7,2.2000000000000002,23,"802.19 comment from Billy Verso on CA document: On the last line of the 1st paragraph of 2.2, the parenthssiesd \"(and under some rules required)\" is a little unclear in meaning.  Suggest to use the term \"regulatory domains\".",null,"Change to \"(and in some regulatorydomains required)\".","No","Accepted"]
[null,null,null,null,"CAD005",null,null,"Technical",7,2.2000000000000002,24,"802.19 comment from Billy Verso on CA document: Sentence, 1st line of 2nd paragraph of 2.2,  \"CCA modes support preamble detection, energy detect, and Aloha.\" is missing mention of \"Carrier Sense\" mode.",null,"Change ot \"The 802.15.4 standard includes several CCA modes including: energy detection, carrier detrection, preamble detection and aloha.\"","No",null,null,null,null,"ASSIGNED",null,"Ben"]
[null,null,null,null,"CAD011",null,null,"Technical",7,2.2000000000000002,null,"802.19 comment from Menzo Wentink on CA document: \"CCA modes support preamble detection, energy detect, and Aloha. There are many (very) different PHYs defined in 802.15.4, with very different signal structures and preambles. Thus no single preamble detection mechanism can be effective in the typical shared spectrum environment where multiple PHYs may be in operation.\"\n\nThe use of the word \"support\" is questionable here because energy detect is not mandatory in 802.15.4. Energy detect may just as well not be supported by an 802.15.4ab device even when it is defined in the standard. Energy detect is the only way to protect ongoing transmissions from other technologies, so it should be mandatory on the narrowband (NB) transmissions.\n\nThe power spectral density (PSD) difference between NB and wideband makes that NB may not be inherently motivated to defer for Wi-Fi, since a collision between the two will have much less impact on the NB signal than on the Wi-Fi signal. The LBT requirement should therefore be enforced through the standard.",null,"802.15.4ab narrowband (NB) transmissions should use listen before talk (LBT). Offline scanning can be used to identify spectrum where the clear channel assessment (CCA) will have the highest probability of being idle.","Yes",null,null,null,null,"ASSIGNED",null,"Ben"]
[null,null,"Alex Krebs",null,"CAD043",null,"Apple","Technical",8,"3","3rd in paragraph","IR-UWB is unknown/undefined",null,"Say what IR-UWB is, or reference.","Yes"]
[null,null,null,null,"CAD006",null,null,"Editorial",8,"3.1.1",15,"802.19 comment from Billy Verso on CA document: Typo, \"Thes\", 1st line 2nd paragraph of 3.1.1.",null,"Change \"Thes\" to \"These\".","No","Accepted"]
{"$rows_left_out":29}
{"sheet":"Sheet1","index":7,"n_rows":42,"n_cols":4,"rows_kept":42,"cut":false,"hidden":false,"merged":[]}
["Voter","# Comments",null,"Vote"]
["Tero Kivinen",586,{"$f":"B2/1471","v":0.39836845683208699},"No"]
["Billy Verso",277,0.18830727396329028,"No"]
["Mickael Maman",77,5.2345343303874914E-2,"Yes"]
["Carlos Aldana",47,3.1951053704962609E-2,"No"]
["Carl Murray",46,3.1271244051665537E-2,"No"]
["Li-Hsiang Sun",45,3.0591434398368457E-2,"No"]
["Bin Qian",40,2.7192386131883073E-2,"No"]
["Pooria Pakrooh",39,2.6512576478585997E-2,"No"]
["Rojan Chitrakar",38,2.5832766825288921E-2,"No"]
["Huan-Bang Li",31,2.1074099252209381E-2,"Yes"]
["Pablo Corbalán Pelegrín",28,1.9034670292318152E-2,"No"]
["Youngwan So",25,1.6995241332426921E-2,"Yes"]
["Alex Krebs",24,1.6315431679129844E-2,"No"]
["B. Rolfe",23,1.5635622025832768E-2,"Yes"]
["Wenzheng Li",19,1.291638341264446E-2,"Non-voter"]
["Aniruddh Rao Kabbinale",15,1.0197144799456152E-2,"Yes"]
["Riku Pirhonen",14,9.5173351461590762E-3,"No"]
["Srivathsa Masthi Parthasarathi",14,9.5173351461590762E-3,"No"]
["Libra Xiao",10,6.7980965329707682E-3,"No"]
{"$rows_left_out":22}